{"text_format":"1","workbook":"xlsx","n_sheets":5,"sheets":["INVOICES","INSTRUCTIONS","SETTINGS","List of Products","List of Prices"],"not_rendered":{"charts":0,"images":6,"macros":1,"external_links":0,"defined_names":0,"comments":0,"pivot_tables":0},"unopened":[],"bounds":{"document_bytes":16777216,"sheet_cells":100000,"rows_first":2000,"rows_last":500,"rows_between":2000,"halvings":0,"cell_chars":16384,"cell_head_chars":4096},"cells_cut":0,"cells_raw":0,"read":"whole","date_system":"1900"}

{"sheet":"INVOICES","index":0,"n_rows":55,"n_cols":16,"rows_kept":55,"cut":false,"hidden":false,"merged":[[1,9,1,15],[47,7,47,9],[49,7,49,9],[33,1,33,2],[33,3,33,5],[33,6,33,10],[33,11,33,12],[33,13,33,15],[45,2,45,7],[45,8,45,15],[31,13,31,15],[32,1,32,2],[32,3,32,5],[32,6,32,10],[32,11,32,12],[32,13,32,15],[41,11,41,12],[42,11,42,12],[43,11,43,12],[41,13,41,15],[42,13,42,15],[43,13,43,15],[38,3,38,5],[38,6,38,10],[38,11,38,12],[38,13,38,15],[39,3,39,5],[39,6,39,10],[39,11,39,12],[39,13,39,15],[36,3,36,5],[36,6,36,10],[36,11,36,12],[36,13,36,15],[37,3,37,5],[37,6,37,10],[37,11,37,12],[37,13,37,15],[27,3,27,5],[27,6,27,10],[27,11,27,12],[27,13,27,15],[24,3,24,5],[24,6,24,10],[24,11,24,12],[24,13,24,15],[25,3,25,5],[25,6,25,10],[25,11,25,12],[25,13,25,15],[18,1,18,2],[18,3,18,5],[18,6,18,10],[18,11,18,12],[18,13,18,15],[19,1,19,2],[19,3,19,5],[19,6,19,10],[19,11,19,12],[19,13,19,15],[20,11,20,12],[20,13,20,15],[35,1,35,2],[30,1,30,2],[30,3,30,5],[30,6,30,10],[30,11,30,12],[31,1,31,2],[31,3,31,5],[31,6,31,10],[31,11,31,12],[30,13,30,15],[29,1,29,6],[20,1,20,2],[20,3,20,5],[20,6,20,10],[23,3,23,5],[23,6,23,10],[23,11,23,12],[23,13,23,15],[26,3,26,5],[26,6,26,10],[26,11,26,12],[26,13,26,15],[13,3,13,5],[13,6,13,10],[16,11,16,12],[16,13,16,15],[17,1,17,2],[17,3,17,5],[17,6,17,10],[17,11,17,12],[17,13,17,15],[14,1,14,2],[14,3,14,5],[14,6,14,10],[14,11,14,12],[14,13,14,15],[15,1,15,2],[15,3,15,5],[15,6,15,10],[15,11,15,12],[36,1,36,2],[37,1,37,2],[38,1,38,2],[39,1,39,2],[9,13,9,15],[10,13,10,15],[9,11,9,12],[10,11,10,12],[3,10,3,11],[3,12,3,15],[5,10,5,15],[6,10,6,15],[13,11,13,12],[13,13,13,15],[7,10,7,15],[22,1,22,4],[15,13,15,15],[16,1,16,2],[16,3,16,5],[16,6,16,10],[10,1,10,2],[10,3,10,5],[10,6,10,10],[13,1,13,2]]}
[]
[null,null,null,null,null,null,null,null,null,"Plio-Grip Material Usage Invoice"]
[]
[null,null,null,null,null,null,null,null,null,null,"Date: "]
[]
[null,null,null,null,null,null,null,null,null,null,"Enter Shop Name"]
[null,null,null,null,null,null,null,null,null,null,"Enter Shop Address"]
[null,null,null,null,null,null,null,null,null,null,"Enter Shop Phone"]
[]
[null,null,null,null,null,null,null,null,null,null,null,"Ins. Comp",null,"Enter Insurance Co"]
[null,"Enter PO #",null,"Enter Name",null,null,"Enter Year Make and Model",null,null,null,null,"Claim #",null,"Enter Claim Number"]
[]
[null,"SMC Repair and Panel Bonding"]
[null,"\tLn. Feet",null,"Bead Size",null,null,"Product",null,null,null,null,"Unit Price",null,"Line Total"]
[null,6,null,"3/8\"",null,null,"Plastic Panel 10 Green (400ml)",null,null,null,null,{"$f":"IF(COUNTBLANK(G15),\"\",VLOOKUP(G15,'List of Prices'!$B$4:$D$22,2,FALSE)*SETTINGS!$B$12+VLOOKUP(G15,'List of Prices'!$B$4:$D$22,2,FALSE))","v":94.159000000000006},null,{"$f":"IF(OR(COUNTBLANK(D15),COUNTBLANK(G15)),\"\",_xlfn.SWITCH(D15,\"1/4\"\"\",(L15/SETTINGS!$I$13)*B15*12, \"3/8\"\"\",(L15/SETTINGS!$I$14)*B15*12, \"1/2\"\"\",(L15/SETTINGS!$I$15)*B15*12, \"5/8\"\"\", (L15/SETTINGS!$I$16)*B15*12, \"3/4\"\"\",(L15/SETTINGS!$I$17)*B15*12, \"7/8\"\"\", (L15/SETTINGS!$I$18)*B15*12, \"1\"\"\", (L15/SETTINGS!$I$19)*B15*12))","v":{"$error":"#NAME?"}}]
[null,null,null,null,null,null,null,null,null,null,null,{"$f":"IF(COUNTBLANK(G16),\"\",VLOOKUP(G16,'List of Prices'!$B$4:$D$22,2,FALSE)*SETTINGS!$B$12+VLOOKUP(G16,'List of Prices'!$B$4:$D$22,2,FALSE))","v":""},null,{"$f":"IF(OR(COUNTBLANK(D16),COUNTBLANK(G16)),\"\",_xlfn.SWITCH(D16,\"1/4\"\"\",(L16/SETTINGS!$I$13)*B16*12, \"3/8\"\"\",(L16/SETTINGS!$I$14)*B16*12, \"1/2\"\"\",(L16/SETTINGS!$I$15)*B16*12, \"3/4\"\"\", (L16/SETTINGS!$I$16)*B16*12, \"1\"\"\",(L16/SETTINGS!$I$14)*B16*17 ))","v":""}]
[null,null,null,null,null,null,null,null,null,null,null,{"$f":"IF(COUNTBLANK(G17),\"\",VLOOKUP(G17,'List of Prices'!$B$4:$D$22,2,FALSE)*SETTINGS!$B$12+VLOOKUP(G17,'List of Prices'!$B$4:$D$22,2,FALSE))","v":""},null,{"$f":"IF(OR(COUNTBLANK(D17),COUNTBLANK(G17)),\"\",_xlfn.SWITCH(D17,\"1/4\"\"\",(L17/SETTINGS!$I$13)*B17*12, \"3/8\"\"\",(L17/SETTINGS!$I$14)*B17*12, \"1/2\"\"\",(L17/SETTINGS!$I$15)*B17*12, \"3/4\"\"\", (L17/SETTINGS!$I$16)*B17*12, \"1\"\"\",(L17/SETTINGS!$I$14)*B17*17 ))","v":""}]
[null,null,null,null,null,null,null,null,null,null,null,{"$f":"IF(COUNTBLANK(G18),\"\",VLOOKUP(G18,'List of Prices'!$B$4:$D$22,2,FALSE)*SETTINGS!$B$12+VLOOKUP(G18,'List of Prices'!$B$4:$D$22,2,FALSE))","v":""},null,{"$f":"IF(OR(COUNTBLANK(D18),COUNTBLANK(G18)),\"\",_xlfn.SWITCH(D18,\"1/4\"\"\",(L18/SETTINGS!$I$13)*B18*12, \"3/8\"\"\",(L18/SETTINGS!$I$14)*B18*12, \"1/2\"\"\",(L18/SETTINGS!$I$15)*B18*12, \"3/4\"\"\", (L18/SETTINGS!$I$16)*B18*12, \"1\"\"\",(L18/SETTINGS!$I$14)*B18*17 ))","v":""}]
[null,null,null,null,null,null,null,null,null,null,null,{"$f":"IF(COUNTBLANK(G19),\"\",VLOOKUP(G19,'List of Prices'!$B$4:$D$22,2,FALSE)*SETTINGS!$B$12+VLOOKUP(G19,'List of Prices'!$B$4:$D$22,2,FALSE))","v":""},null,{"$f":"IF(OR(COUNTBLANK(D19),COUNTBLANK(G19)),\"\",_xlfn.SWITCH(D19,\"1/4\"\"\",(L19/SETTINGS!$I$13)*B19*12, \"3/8\"\"\",(L19/SETTINGS!$I$14)*B19*12, \"1/2\"\"\",(L19/SETTINGS!$I$15)*B19*12, \"3/4\"\"\", (L19/SETTINGS!$I$16)*B19*12, \"1\"\"\",(L19/SETTINGS!$I$14)*B19*17 ))","v":""}]
[null,null,null,null,null,null,null,null,null,null,null,{"$f":"IF(COUNTBLANK(G20),\"\",VLOOKUP(G20,'List of Prices'!$B$4:$D$22,2,FALSE)*SETTINGS!$B$12+VLOOKUP(G20,'List of Prices'!$B$4:$D$22,2,FALSE))","v":""},null,{"$f":"IF(OR(COUNTBLANK(D20),COUNTBLANK(G20)),\"\",_xlfn.SWITCH(D20,\"1/4\"\"\",(L20/SETTINGS!$I$13)*B20*12, \"3/8\"\"\",(L20/SETTINGS!$I$14)*B20*12, \"1/2\"\"\",(L20/SETTINGS!$I$15)*B20*12, \"3/4\"\"\", (L20/SETTINGS!$I$16)*B20*12, \"1\"\"\",(L20/SETTINGS!$I$14)*B20*17 ))","v":""}]
[null,null,null,null,null,null,null,null,null,null,null,{"$f":"IF(COUNTBLANK(G21),\"\",VLOOKUP(G21,'List of Prices'!$B$4:$D$22,2,FALSE)*SETTINGS!$B$12+VLOOKUP(G21,'List of Prices'!$B$4:$D$22,2,FALSE))","v":""},null,{"$f":"IF(OR(COUNTBLANK(D21),COUNTBLANK(G21)),\"\",_xlfn.SWITCH(D21,\"1/4\"\"\",(L21/SETTINGS!$I$13)*B21*12, \"3/8\"\"\",(L21/SETTINGS!$I$14)*B21*12, \"1/2\"\"\",(L21/SETTINGS!$I$15)*B21*12, \"3/4\"\"\", (L21/SETTINGS!$I$16)*B21*12, \"1\"\"\",(L21/SETTINGS!$I$14)*B21*17 ))","v":""}]
[]
[null,"Plastic Repair"]
[null,null,null,"Area in Sq. Inches",null,null,"Product",null,null,null,null,"Unit Price",null,"Line Total"]
[null,null,null,null,null,null,null,null,null,null,null,{"$f":"IF(COUNTBLANK(G25),\"\",VLOOKUP(G25,'List of Prices'!$B$26:$D$32,2,FALSE)+VLOOKUP(G25,'List of Prices'!$B$26:$D$32,2,FALSE)*SETTINGS!$B$12)","v":""},null,{"$f":" IF(COUNTBLANK(G25),\"\",IF(OR(G25 = \"Finishing Cream\", G25 = \"Finishing Cream 10\"), (L25/SETTINGS!$E$12 + 0.09)*D25, (L25/SETTINGS!$E$12 + 0.1)*D25))","v":""}]
[null,null,null,null,null,null,null,null,null,null,null,{"$f":"IF(COUNTBLANK(G26),\"\",VLOOKUP(G26,'List of Prices'!$B$26:$D$32,2,FALSE)+VLOOKUP(G26,'List of Prices'!$B$26:$D$32,2,FALSE)*SETTINGS!$B$12)","v":""},null,{"$f":" IF(COUNTBLANK(G26),\"\",IF(OR(G26 = \"Finishing Cream\", G26 = \"Finishing Cream 10\"), (L26/SETTINGS!$E$12 + 0.09), (L26/SETTINGS!$E$12 + 0.1)*D26))","v":""}]
[null,null,null,null,null,null,null,null,null,null,null,{"$f":"IF(COUNTBLANK(G27),\"\",VLOOKUP(G27,'List of Prices'!$B$26:$D$32,2,FALSE)+VLOOKUP(G27,'List of Prices'!$B$26:$D$32,2,FALSE)*SETTINGS!$B$12)","v":""},null,{"$f":" IF(COUNTBLANK(G27),\"\",IF(OR(G27 = \"Finishing Cream\", G27 = \"Finishing Cream 10\"), (L27/SETTINGS!$E$12 + 0.09), (L27/SETTINGS!$E$12 + 0.1)*D27))","v":""}]
[null,null,null,null,null,null,null,null,null,null,null,{"$f":"IF(COUNTBLANK(G28),\"\",VLOOKUP(G28,'List of Prices'!$B$26:$D$32,2,FALSE)+VLOOKUP(G28,'List of Prices'!$B$26:$D$32,2,FALSE)*SETTINGS!$B$12)","v":""},null,{"$f":" IF(COUNTBLANK(G28),\"\",IF(OR(G28 = \"Finishing Cream\", G28 = \"Finishing Cream 10\"), (L28/SETTINGS!$E$12 + 0.09), (L28/SETTINGS!$E$12 + 0.1)*D28))","v":""}]
[]
[null,"Sealers"]
[null,"\tLn. Feet",null,"Bead Size",null,null,"Product",null,null,null,null,"Unit Price",null,"Line Total"]
[null,null,null,null,null,null,null,null,null,null,null,{"$f":"IF(COUNTBLANK(G32),\"\",VLOOKUP(G32,'List of Prices'!$B$36:$D$43,2,FALSE)+VLOOKUP(G32,'List of Prices'!$B$36:$D$43,2,FALSE)*SETTINGS!$B$12)","v":""},null,{"$f":"IF(OR(COUNTBLANK(D32),COUNTBLANK(G32)),\"\",_xlfn.SWITCH(D32,\"1/4\"\"\",(L32/SETTINGS!$I$13)*B32*12, \"3/8\"\"\",(L32/SETTINGS!$I$14)*B32*12, \"1/2\"\"\",(L32/SETTINGS!$I$15)*B32*12, \"5/8\"\"\", (L32/SETTINGS!$I$16)*B32*12, \"3/4\"\"\",(L32/SETTINGS!$I$17)*B32*12, \"7/8\"\"\", (L32/SETTINGS!$I$18)*B32*12, \"1\"\"\", (L32/SETTINGS!$I$19)*B32*12))","v":""}]
[null,null,null,null,null,null,null,null,null,null,null,{"$f":"IF(COUNTBLANK(G33),\"\",VLOOKUP(G33,'List of Prices'!$B$36:$D$43,2,FALSE)+VLOOKUP(G33,'List of Prices'!$B$36:$D$43,2,FALSE)*SETTINGS!$B$12)","v":""},null,{"$f":"IF(OR(COUNTBLANK(D33),COUNTBLANK(G33)),\"\",_xlfn.SWITCH(D33,\"1/4\"\"\",(L33/SETTINGS!$I$13)*B33*12, \"3/8\"\"\",(L33/SETTINGS!$I$14)*B33*12, \"1/2\"\"\",(L33/SETTINGS!$I$15)*B33*12, \"5/8\"\"\", (L33/SETTINGS!$I$16)*B33*12, \"3/4\"\"\",(L33/SETTINGS!$I$17)*B33*12, \"7/8\"\"\", (L33/SETTINGS!$I$18)*B33*12, \"1\"\"\", (L33/SETTINGS!$I$19)*B33*12))","v":""}]
[null,null,null,null,null,null,null,null,null,null,null,{"$f":"IF(COUNTBLANK(G34),\"\",VLOOKUP(G34,'List of Prices'!$B$36:$D$43,2,FALSE)+VLOOKUP(G34,'List of Prices'!$B$36:$D$43,2,FALSE)*SETTINGS!$B$12)","v":""},null,{"$f":"IF(OR(COUNTBLANK(D34),COUNTBLANK(G34)),\"\",_xlfn.SWITCH(D34,\"1/4\"\"\",(L34/SETTINGS!$I$13)*B34*12, \"3/8\"\"\",(L34/SETTINGS!$I$14)*B34*12, \"1/2\"\"\",(L34/SETTINGS!$I$15)*B34*12, \"5/8\"\"\", (L34/SETTINGS!$I$16)*B34*12, \"3/4\"\"\",(L34/SETTINGS!$I$17)*B34*12, \"7/8\"\"\", (L34/SETTINGS!$I$18)*B34*12, \"1\"\"\", (L34/SETTINGS!$I$19)*B34*12))","v":""}]
[]
[null,"Foams"]
[null,null,null,"Area in Sq. Inches",null,null,"Product",null,null,null,null,"Unit Price",null,"Line Total"]
[null,null,null,null,null,null,null,null,null,null,null,{"$f":"IF(COUNTBLANK(G38),\"\",VLOOKUP(G38,'List of Prices'!$B$47:$D$48,2,FALSE)+VLOOKUP(G38,'List of Prices'!$B$47:$D$48,2,FALSE)*SETTINGS!$B$12)","v":""},null,{"$f":" IF(COUNTBLANK(G38),\"\",(L38/SETTINGS!$E$12 + 0.1)*D38)","v":""}]
[null,null,null,null,null,null,null,null,null,null,null,{"$f":"IF(COUNTBLANK(G39),\"\",VLOOKUP(G39,'List of Prices'!$B$47:$D$48,2,FALSE)+VLOOKUP(G39,'List of Prices'!$B$47:$D$48,2,FALSE)*SETTINGS!$B$12)","v":""},null,{"$f":" IF(COUNTBLANK(G39),\"\",(L39/SETTINGS!$E$12 + 0.1)*D39)","v":""}]
[null,null,null,null,null,null,null,null,null,null,null,{"$f":"IF(COUNTBLANK(G40),\"\",VLOOKUP(G40,'List of Prices'!$B$47:$D$48,2,FALSE)+VLOOKUP(G40,'List of Prices'!$B$47:$D$48,2,FALSE)*SETTINGS!$B$12)","v":""},null,{"$f":" IF(COUNTBLANK(G40),\"\",(L40/SETTINGS!$E$12 + 0.1)*D40)","v":""}]
[]
[null,null,null,null,null,null,null,null,null,null,null,"Subtotal",null,{"$f":"SUM(N38:P40,N32:P34,N25:P28,N15:P21)","v":{"$error":"#NAME?"}}]
[null,null,null,null,null,null,null,null,null,null,null,"Tax Rate",null,0]
[null,null,null,null,null,null,null,null,null,null,null,"TOTAL",null,{"$f":"N42*N43 + N42","v":{"$error":"#NAME?"}}]
[]
[]
[]
[]
[]
[]
[]
[null,"Bonding Solutions, Inc."]
[null,"PO Box 21537 • Reno, NV 89515",null,null,null,null,null,null,null,null,null,null,null,null,null,"Meets OEM Specifications"]
[null,"(888) 954-5390 • (775) 358-0422 • Fax: (775) 358-0311",null,null,null,null,null,null,null,null,null,null,null,null,null,"OEM Supplier"]
[null,"Made in the USA",null,null,null,null,null,null,null,null,null,null,null,null,null,"Aluminum Approved"]

{"sheet":"INSTRUCTIONS","index":1,"n_rows":9,"n_cols":2,"rows_kept":9,"cut":false,"hidden":false,"merged":[[1,1,1,7]]}
[]
[null,"* DO NOT touch the tabs labeled \"List of Products\" or \"List of Prices\""]
[null,"Instructions"]
[]
[null,"How to change the price"]
[null,"1. Move to the \"Settings\" tab."]
[null,"2. Choose the product that you want to change the price of by using the drop down menu."]
[null,"3. Insert a new price underneath the product name."]
[null,"4. Click the SET button underneath the product you want to change the price of."]

{"sheet":"SETTINGS","index":2,"n_rows":19,"n_cols":12,"rows_kept":19,"cut":false,"hidden":true,"merged":[[1,1,1,11],[3,1,3,2],[3,4,3,5],[3,7,3,8],[3,10,3,11],[10,1,10,2],[11,1,11,2],[10,4,10,5],[10,7,10,8],[11,4,11,5]]}
[]
[null,"Settings"]
[]
[null,"SMC Repair and Bonding",null,null,"Plastic Repairs",null,null,"Sealers",null,null,"Foams"]
[null,"Product:","Plastic Panel 3 Green (400ml)",null,"Product:","Rapid Repair",null,"Product:","DTM 15 Sealer",null,"Product:","NVH Flexible Foam"]
[null,"Unit Price:",0,null,"Price/Sq. Area:",0,null,"Unit Price:",0,null,"Price/Sq. Area:",0]
[]
[]
[]
[]
[null,"MARKUP Percentage",null,null,"SQ\"/Tube",null,null,"Linear Ft"]
[null,0.3,null,null,600,null,null,"Bead Diameter","Linear Ft./Tube"]
[null,null,null,null,null,null,null,"1/4\"",496]
[null,null,null,null,null,null,null,"3/8\"",220]
[null,null,null,null,null,null,null,"1/2\"",124]
[null,null,null,null,null,null,null,"5/8\"",76]
[null,null,null,null,null,null,null,"3/4\"",56]
[null,null,null,null,null,null,null,"7/8\"",40]
[null,null,null,null,null,null,null,"1\"",32]

{"sheet":"List of Products","index":3,"n_rows":24,"n_cols":14,"rows_kept":24,"cut":false,"hidden":true,"merged":[[1,12,1,13],[1,6,1,7],[1,3,1,4],[1,9,1,10]]}
[]
[null,"Product Types",null,"Plastic Repairs",null,null,"SMC Repair and Panel Bonding",null,null,"Sealers",null,null,"Foams"]
[null,"Plastic Repairs",null,null,"Product",null,"Bead Size","Product",null,"Bead Size","Product",null,null,"Product"]
[null,"SMC Repair and Panel Bonding"]
[null,"Sealers",null,null,"Rapid Repair",null,"1/4\"","Plastic Panel 3 Green (400ml)",null,"1/4\"","DTM 15 Sealer",null,null,"NVH Flexible Foam"]
[null,"Foams",null,null,"Plastic Repair 1",null,"3/8\"","Plastic Panel 3 Green (600ml)",null,"3/8\"","Non-Sag Seam Sealer 6",null,null,"NVH Rigid Foam"]
[null,null,null,null,"Plastic Repair 3",null,"1/2\"","Plastic Panel 10 Green (400ml)",null,"1/2\"","High-body Seam Sealer 12"]
[null,null,null,null,"Plastic Repair 10",null,"5/8\"","Plastic Panel 10 Green (600ml)",null,"3/4\"","DTM 15 Control Flow Seam Sealer"]
[null,null,null,null,"Finishing Cream",null,"3/4\"","Plastic Panel 15 Green (220ml)",null,"1\"","Controlled-Flow Seam Sealer 6"]
[null,null,null,null,"Finishing Cream 10",null,"7/8\"","Plastic Panel 35 Green (220ml)",null,null,"DTM 20(BLACK) 1K MSP"]
[null,null,null,null,"Adhesion Promoter",null,"1\"","Plastic Panel 35 Green (400ml)",null,null,"DTM 20 (WHITE) 1K MSP"]
[null,null,null,null,null,null,null,"Plastic Panel 35 Green (600ml)",null,null,"DTM 20(BEIGE) 1K MSP"]
[null,null,null,null,null,null,null,"Plastic Panel 35 Black (220ml)"]
[null,null,null,null,null,null,null,"SMC Repair and Bonding (220ml)"]
[null,null,null,null,null,null,null,"SMC Repair and Bonding (400ml)"]
[]
[null,null,null,null,null,null,null,"Door Skin 30"]
[null,null,null,null,null,null,null,"Panel 60 (220ml)"]
[null,null,null,null,null,null,null,"Panel 60 (400ml)"]
[null,null,null,null,null,null,null,"Panel 90"]
[null,null,null,null,null,null,null,"5770 Impact Adhesive"]
[null,null,null,null,null,null,null,"EPOXY Metal and Alum. Adhesive"]
[null,null,null,null,null,null,null,"1010C Acrylic Bonder -10 minute"]
[null,null,null,null,null,null,null,"1010C Acrylic Bonder -5 minute"]

{"sheet":"List of Prices","index":4,"n_rows":48,"n_cols":3,"rows_kept":48,"cut":false,"hidden":true,"merged":[[8,2,8,3],[3,2,3,3],[42,2,42,3],[24,2,24,3],[25,2,25,3],[26,2,26,3],[9,2,9,3],[11,2,11,3],[10,2,10,3],[29,2,29,3],[28,2,28,3],[21,2,21,3],[45,2,45,3],[46,2,46,3],[47,2,47,3],[2,2,2,3],[15,2,15,3],[16,2,16,3],[17,2,17,3],[18,2,18,3],[19,2,19,3],[20,2,20,3],[27,2,27,3],[30,2,30,3],[31,2,31,3],[34,2,34,3],[35,2,35,3],[41,2,41,3],[44,1,44,3],[38,2,38,3],[39,2,39,3],[40,2,40,3],[1,1,1,3],[23,1,23,3],[33,1,33,3],[4,2,4,3],[7,2,7,3],[6,2,6,3],[5,2,5,3],[36,2,36,3],[37,2,37,3],[14,2,14,3],[13,2,13,3],[12,2,12,3]]}
[]
[null,"SMC Repair and Panel Bonding"]
[null,"Product","Unit Price"]
[null,"Plastic Panel 3 Green (400ml)",72.430000000000007]
[null,"Plastic Panel 3 Green (600ml)",91.2]
[null,"Plastic Panel 10 Green (400ml)",72.430000000000007]
[null,"Plastic Panel 10 Green (600ml)",91.2]
[null,"Plastic Panel 15 Green (220ml)",41.84]
[null,"Plastic Panel 35 Green (220ml)",41.84]
[null,"Plastic Panel 35 Green (400ml)",72.430000000000007]
[null,"Plastic Panel 35 Green (600ml)",91.2]
[null,"Plastic Panel 35 Black (220ml)",46.14]
[null,"SMC Repair and Bonding (220ml)",41.84]
[null,"SMC Repair and Bonding (400ml)",72.430000000000007]
[null,"Door Skin 30",41.84]
[null,"Panel 60 (220ml)",43.99]
[null,"Panel 60 (400ml)",72.430000000000007]
[null,"Panel 90",43.99]
[null,"5770 Impact Adhesive",80.25]
[null,"EPOXY Metal and Alum. Adhesive",72.430000000000007]
[null,"1010C Acrylic Bonder -10 minute",91.2]
[null,"1010C Acrylic Bonder -5 minute",91.2]
[]
[null,"Plastic Repairs"]
[null,"Product","Unit Price"]
[null,"Rapid Repair",41.84]
[null,"Plastic Repair 1",41.84]
[null,"Plastic Repair 3",41.84]
[null,"Plastic Repair 10",41.84]
[null,"Finishing Cream",41.84]
[null,"Finishing Cream 10",41.84]
[null,"Adhesion Promoter",22.53]
[]
[null,"Sealers"]
[null,"Product","Unit Price"]
[null,"DTM 15 Sealer",37.549999999999997]
[null,"Non-Sag Seam Sealer 6",37.549999999999997]
[null,"High-body Seam Sealer 12",37.549999999999997]
[null,"DTM 15 Control Flow Seam Sealer",37.659999999999997]
[null,"Controlled-Flow Seam Sealer 6",37.659999999999997]
[null,"DTM 20(BLACK) 1K MSP",17.440000000000001]
[null,"DTM 20 (WHITE) 1K MSP",17.440000000000001]
[null,"DTM 20(BEIGE) 1K MSP",17.440000000000001]
[]
[null,"Foams"]
[null,"Product","Unit Price"]
[null,"NVH Flexible Foam",37.549999999999997]
[null,"NVH Rigid Foam",37.549999999999997]